Target
Gag-Pol polyprotein [489-587]
Ligand
BDBM9291
Substrate
Meas. Tech.
ChEMBL_158029 (CHEMBL877854)
IC50
0.05±n/a nM
Citation
 Pérez, CPastor, MOrtiz, ARGago, F Comparative binding energy analysis of HIV-1 protease inhibitors: incorporation of solvent effects and validation as a powerful tool in receptor-based drug design. J Med Chem 41:836-52 (1998)  
Target
Name:
Gag-Pol polyprotein [489-587]
Synonyms:
Human immunodeficiency virus type 1 protease Pol polyprotein | gag-pol
Type:
Enzyme Subunit
Mol. Mass.:
10781.16
Organism:
Human immunodeficiency virus type 1
Description:
P04585[489-587]
Residue:
99
  
Inhibitor
Name:
BDBM9291
Synonyms:
(3S,4aS,8aS)-N-tert-butyl-2-[(2R,3S)-2-hydroxy-3-[(2S)-2-[(3R)-oxolan-3-yl]-2-(quinolin-2-ylformamido)acetamido]-4-phenylbutyl]-decahydroisoquinoline-3-carboxamide | Ro 31-8959 (Saquinavir) analog 23
Type:
Small organic molecule
Emp. Form.:
C40H53N5O5
Mol. Mass.:
683.8793
SMILES:
CC(C)(C)NC(=O)[C@@H]1C[C@@H]2CCCC[C@@H]2CN1C[C@@H](O)[C@H](Cc1ccccc1)NC(=O)[C@@H](NC(=O)c1ccc2ccccc2n1)[C@H]1CCOC1
: