Target
Acetylcholinesterase
Ligand
BDBM50064176
Substrate
Meas. Tech.
ChEMBL_28898 (CHEMBL638447)
IC50
5370±n/a nM
Citation
 Bolognesi, MLBixel, MGMarucci, GBartolini, MKrauss, MAngeli, PAntonello, ARosini, MTumiatti, VHucho, FMelchiorre, C Structure-activity relationships of methoctramine-related polyamines as muscular nicotinic receptor noncompetitive antagonists. 3. Effect of inserting the tetraamine backbone into a macrocyclic structure. J Med Chem 45:3286-95 (2002)  
Target
Name:
Acetylcholinesterase
Synonyms:
ACES_HUMAN Acetylcholinesterase (AChE) | Acetylcholinesterase (human AChE)
Type:
Enzyme
Mol. Mass.:
67792.70
Organism:
Homo sapiens (Human)
Description:
P22303
Residue:
614
  
Inhibitor
Name:
BDBM50064176
Synonyms:
CHEMBL27673 METHOCTRAMINE N1,N8-bis(6-(2-methoxybenzylamino)hexyl)octane-1,8-diamine
Type:
Small organic molecule
Emp. Form.:
C36H62N4O2
Mol. Mass.:
582.9031
SMILES:
COc1ccccc1CNCCCCCCNCCCCCCCCNCCCCCCNCc1ccccc1OC
: