Target
Mitogen-activated protein kinase 8
Ligand
BDBM50422615
Substrate
Meas. Tech.
ChEMBL_307280 (CHEMBL831665)
IC50
6310±n/a nM
Citation
 Stocks, MJBarber, SFord, RLeroux, FSt-Gallay, STeague, SXue, Y Structure-driven HtL: design and synthesis of novel aminoindazole inhibitors of c-Jun N-terminal kinase activity. Bioorg Med Chem Lett 15:3459-62 (2005)  
Target
Name:
Mitogen-activated protein kinase 8
Synonyms:
JNK-46 JNK1-alpha-1 MK08_HUMAN PRKM8 SAPK1C c-Jun N-terminal kinase 1 c-Jun N-terminal kinase 1(JNK1) | c-Jun N-terminal kinase 2 (JNK2)
Type:
Enzyme
Mol. Mass.:
48297.57
Organism:
Homo sapiens (Human)
Description:
JNK-1 was purchased from Upstate Cell Signaling Solutions (formerly Upstate Biotechnology).
Residue:
427
  
Inhibitor
Name:
BDBM50422615
Synonyms:
CHEMBL190812
Type:
Small organic molecule
Emp. Form.:
C20H18N2O2
Mol. Mass.:
318.3691
SMILES:
C[C@H](NC(=O)c1cccnc1Oc1ccccc1)c1ccccc1
: