Target
Integrin alpha-4/beta-1
Ligand
BDBM50170972
Substrate
Meas. Tech.
ChEMBL_305562 (CHEMBL828581)
IC50
6.0±n/a nM
Citation
 Venkatraman, SLim, JCramer, MGardner, MFJames, JAlves, KLingham, RBMumford, RAMunoz, B Influence of acid surrogates toward potency of VLA-4 antagonist. Bioorg Med Chem Lett 15:4053-6 (2005)  
Target
Name:
Integrin alpha-4/beta-1
Synonyms:
Fibronectin receptor beta/Integrin alpha-4 | Integrin alpha-4/beta-1
Type:
Mol. Mass.:
Description:
ASSAY_ID of EBI is 88912
Components:
This complex has 2 components.
Component 1
Name:
Integrin beta-1
Synonyms:
CD_antigen=CD29 Fibronectin receptor beta GPIIA ITGB1 MDF2 | MSK12
Type:
Enzyme
Mol. Mass.:
88400.38
Organism:
Homo sapiens (Human)
Description:
P05556
Residue:
798
  
Component 2
Name:
Integrin alpha-4
Synonyms:
CD49 antigen-like family member D CD49d antigen ITA4_HUMAN Integrin alpha-4 Integrin alpha-IV VLA-4 integrin alpha 4 precursor | integrin alpha-4 precursor
Type:
Membrane Protein
Mol. Mass.:
114897.35
Organism:
Homo sapiens (Human)
Description:
P13612
Residue:
1032
  
Inhibitor
Name:
BDBM50170972
Synonyms:
(S)-1-(3,5-Dichloro-benzenesulfonyl)-pyrrolidine-2-carboxylic acid [(S)-2-(2',6'-dimethoxy-biphenyl-4-yl)-1-(3,5-dioxo-[1,2,4]oxadiazolidin-2-ylmethyl)-ethyl]-amide | CHEMBL373343
Type:
Small organic molecule
Emp. Form.:
C30H30Cl2N4O8S
Mol. Mass.:
677.552
SMILES:
COc1cccc(OC)c1-c1ccc(C[C@@H](Cn2oc(=O)[nH]c2=O)NC(=O)[C@@H]2CCCN2S(=O)(=O)c2cc(Cl)cc(Cl)c2)cc1
: