Target
Integrin alpha-4/beta-1
Ligand
BDBM50170978
Substrate
Meas. Tech.
ChEMBL_305562 (CHEMBL828581)
IC50
20±n/a nM
Citation
 Venkatraman, SLim, JCramer, MGardner, MFJames, JAlves, KLingham, RBMumford, RAMunoz, B Influence of acid surrogates toward potency of VLA-4 antagonist. Bioorg Med Chem Lett 15:4053-6 (2005)  
Target
Name:
Integrin alpha-4/beta-1
Synonyms:
Fibronectin receptor beta/Integrin alpha-4 | Integrin alpha-4/beta-1
Type:
Mol. Mass.:
Description:
ASSAY_ID of EBI is 88912
Components:
This complex has 2 components.
Component 1
Name:
Integrin beta-1
Synonyms:
CD_antigen=CD29 Fibronectin receptor beta GPIIA ITGB1 MDF2 | MSK12
Type:
Enzyme
Mol. Mass.:
88400.38
Organism:
Homo sapiens (Human)
Description:
P05556
Residue:
798
  
Component 2
Name:
Integrin alpha-4
Synonyms:
CD49 antigen-like family member D CD49d antigen ITA4_HUMAN Integrin alpha-4 Integrin alpha-IV VLA-4 integrin alpha 4 precursor | integrin alpha-4 precursor
Type:
Membrane Protein
Mol. Mass.:
114897.35
Organism:
Homo sapiens (Human)
Description:
P13612
Residue:
1032
  
Inhibitor
Name:
BDBM50170978
Synonyms:
3,5-Dichloro-N-{4-[2-{[(S)-1-(3,5-dichloro-benzenesulfonyl)-pyrrolidine-2-carbonyl]-amino}-2-((S)-3-hydroxy-isoxazol-5-yl)-ethyl]-phenyl}-isonicotinamide | CHEMBL366338
Type:
Small organic molecule
Emp. Form.:
C28H23Cl4N5O6S
Mol. Mass.:
699.389
SMILES:
Clc1cc(Cl)cc(c1)S(=O)(=O)N1CCC[C@H]1C(=O)N[C@@H](Cc1ccc(NC(=O)c2c(Cl)cncc2Cl)cc1)c1cc(=O)[nH]o1
: