Target
Beta-1 adrenergic receptor
Ligand
BDBM50422862
Substrate
Meas. Tech.
ChEMBL_362746 (CHEMBL868153)
Kd
0.079400±n/a nM
Citation
 Rezmann-Vitti, LANero, TLJackman, GPMachida, CADuke, BJLouis, WJLouis, SN Role of Tyr(356(7.43)) and Ser(190(4.57)) in antagonist binding in the rat beta1-adrenergic receptor. J Med Chem 49:3467-77 (2006)  
Target
Name:
Beta-1 adrenergic receptor
Synonyms:
ADRB1R, B1AR Adrb1 Adrenergic receptor beta Beta-1 adrenoreceptor adrenergic Beta1,2
Type:
Protein
Mol. Mass.:
50486.84
Organism:
Rattus norvegicus (Rat)
Description:
P18090
Residue:
466
  
Inhibitor
Name:
BDBM50422862
Synonyms:
125I-CYP | CHEMBL210309
Type:
Small organic molecule
Emp. Form.:
C16H20IN3O2
Mol. Mass.:
413.2534
SMILES:
CC(C)(C)NCC(O)COc1cccc2[nH]c(C#N)c(I)c12
: