Target
Macrophage metalloelastase
Ligand
BDBM50129994
Substrate
Meas. Tech.
ChEMBL_458938 (CHEMBL924957)
IC50
4.0±n/a nM
Citation
 Verma, RPHansch, C Matrix metalloproteinases (MMPs): chemical-biological functions and (Q)SARs. Bioorg Med Chem 15:2223-68 (2007)  
Target
Name:
Macrophage metalloelastase
Synonyms:
HME MMP12_HUMAN Matrix metalloproteinase-12 (MMP 12) Matrix metalloproteinase-12 (MMP12) | Matrix metalloproteinases 12 (MMP-12)
Type:
Enzyme
Mol. Mass.:
54012.99
Organism:
Homo sapiens (Human)
Description:
P39900
Residue:
470
  
Inhibitor
Name:
BDBM50129994
Synonyms:
2-(((S)-3,3-dimethyl-1-(methylamino)-1-oxobutan-2-yl)carbamoyl)-4-phenylbutyl(4-(2-methoxybenzyl)benzyl)phosphinic acid [2-((S)-2,2-Dimethyl-1-methylcarbamoyl-propylcarbamoyl)-4-phenyl-butyl]-[4-(2-methoxy-benzyl)-benzyl]-phosphinic acid
Type:
Small organic molecule
Emp. Form.:
C33H43N2O5P
Mol. Mass.:
578.6787
SMILES:
CNC(=O)[C@@H](NC(=O)C(CCc1ccccc1)CP(O)(=O)Cc1ccc(Cc2ccccc2OC)cc1)C(C)(C)C
: