Target
Stromelysin-1
Ligand
BDBM50241372
Substrate
Meas. Tech.
ChEMBL_458939 (CHEMBL924958)
Ki
708±n/a nM
Citation
 Verma, RPHansch, C Matrix metalloproteinases (MMPs): chemical-biological functions and (Q)SARs. Bioorg Med Chem 15:2223-68 (2007)  
Target
Name:
Stromelysin-1
Synonyms:
MMP-3 MMP3_HUMAN Matrix metalloproteinase 3 Matrix metalloproteinase-3 (MMP-3) SL-1 Stromelysin 1 | Transin-1
Type:
Enzyme
Mol. Mass.:
53973.13
Organism:
Homo sapiens (Human)
Description:
P08254
Residue:
477
  
Inhibitor
Name:
BDBM50241372
Synonyms:
(S)-1-(1-(methylamino)-1-oxo-3-phenylpropan-2-yl)-3-(5-thioxo-4,5-dihydro-1,3,4-thiadiazol-2-yl)urea 2-[3-(5-MERCAPTO-[1,3,4]THIADIAZOL-2-YL)-UREIDO]-N-METHYL-3-PHENYL-PROPIONAMIDE PNU-107859
Type:
Small organic molecule
Emp. Form.:
C13H15N5O2S2
Mol. Mass.:
337.421
SMILES:
CNC(=O)[C@H](Cc1ccccc1)NC(=O)Nc1nnc(S)s1
: