Target
Matrix metalloproteinase-9
Ligand
BDBM11334
Substrate
Meas. Tech.
ChEMBL_458932 (CHEMBL924951)
Ki
138±n/a nM
Citation
 Verma, RPHansch, C Matrix metalloproteinases (MMPs): chemical-biological functions and (Q)SARs. Bioorg Med Chem 15:2223-68 (2007)  
Target
Name:
Matrix metalloproteinase-9
Synonyms:
67 kDa matrix metalloproteinase-9 92 kDa gelatinase CLG4B Gelatinase B MMP9 Matrix metalloproteinase 9 (MMP-9) Matrix metalloproteinase-9 (MMP9)
Type:
Enzyme
Mol. Mass.:
78452.28
Organism:
Homo sapiens (Human)
Description:
P14780
Residue:
707
  
Inhibitor
Name:
BDBM11334
Synonyms:
Hydroxamate 15 | N-hydroxy-2-[(4-methoxybenzene)sulfonamido]propanamide
Type:
Small organic molecule
Emp. Form.:
C10H14N2O5S
Mol. Mass.:
274.294
SMILES:
COc1ccc(cc1)S(=O)(=O)NC(C)C(=O)NO
: