Target
72 kDa type IV collagenase
Ligand
BDBM11328
Substrate
Meas. Tech.
ChEMBL_458931 (CHEMBL924950)
Ki
110±n/a nM
Citation
 Verma, RPHansch, C Matrix metalloproteinases (MMPs): chemical-biological functions and (Q)SARs. Bioorg Med Chem 15:2223-68 (2007)  
Target
Name:
72 kDa type IV collagenase
Synonyms:
72 kDa gelatinase CLG4A Gelatinase A (MMP-2) MMP2_HUMAN Matrix metalloproteinase-2 (MMP 2) Matrix metalloproteinases 2 (MMP-2) | TBE-1
Type:
Enzyme
Mol. Mass.:
73870.36
Organism:
Homo sapiens (Human)
Description:
P08253
Residue:
660
  
Inhibitor
Name:
BDBM11328
Synonyms:
CHEMBL83508 N-hydroxy-2-[(4-methoxybenzene)sulfonamido]acetamide
Type:
Small organic molecule
Emp. Form.:
C9H12N2O5S
Mol. Mass.:
260.267
SMILES:
COc1ccc(cc1)S(=O)(=O)NCC(=O)NO
: