Target
Somatostatin receptor type 1
Ligand
BDBM50423462
Substrate
Meas. Tech.
ChEMBL_461987 (CHEMBL944830)
Kd
1.2±n/a nM
Citation
 Troxler, TEnz, AHoyer, DLangenegger, DNeumann, PPfäffli, PSchoeffter, PHurth, K Ergoline derivatives as highly potent and selective antagonists at the somatostatin sst 1 receptor. Bioorg Med Chem Lett 18:979-82 (2008)  
Target
Name:
Somatostatin receptor type 1
Synonyms:
SOMATOSTATIN SST1 SS-1-R SS1R SSTR1 | Somatostatin receptor type 1 (SSTR1)
Type:
Enzyme
Mol. Mass.:
42692.81
Organism:
Homo sapiens (Human)
Description:
P30872
Residue:
391
  
Inhibitor
Name:
BDBM50423462
Synonyms:
CHEMBL251835
Type:
Small organic molecule
Emp. Form.:
C26H27BrN6O2
Mol. Mass.:
535.436
SMILES:
CN1C[C@@H](C[C@H]2[C@H]1Cc1c(Br)[nH]c3cccc2c13)C(=O)N1CCN(CC1)c1ccc2nonc2c1
: