Target
Somatostatin receptor type 2
Ligand
BDBM50423462
Substrate
Meas. Tech.
ChEMBL_461988 (CHEMBL944831)
Kd
6761±n/a nM
Citation
 Troxler, TEnz, AHoyer, DLangenegger, DNeumann, PPfäffli, PSchoeffter, PHurth, K Ergoline derivatives as highly potent and selective antagonists at the somatostatin sst 1 receptor. Bioorg Med Chem Lett 18:979-82 (2008)  
Target
Name:
Somatostatin receptor type 2
Synonyms:
SOMATOSTATIN SST2 SS-2-R SS2R SSTR2 | Somatostatin receptor type 2 (SSTR2)
Type:
Enzyme
Mol. Mass.:
41344.94
Organism:
Homo sapiens (Human)
Description:
P30874
Residue:
369
  
Inhibitor
Name:
BDBM50423462
Synonyms:
CHEMBL251835
Type:
Small organic molecule
Emp. Form.:
C26H27BrN6O2
Mol. Mass.:
535.436
SMILES:
CN1C[C@@H](C[C@H]2[C@H]1Cc1c(Br)[nH]c3cccc2c13)C(=O)N1CCN(CC1)c1ccc2nonc2c1
: