Target
Sex hormone-binding globulin
Ligand
BDBM50423506
Substrate
Meas. Tech.
ChEMBL_466706 (CHEMBL922711)
Kd
2138±n/a nM
Citation
 Cherkasov, ABan, FSantos-Filho, OThorsteinson, NFallahi, MHammond, GL An updated steroid benchmark set and its application in the discovery of novel nanomolar ligands of sex hormone-binding globulin. J Med Chem 51:2047-56 (2008)  
Target
Name:
Sex hormone-binding globulin
Synonyms:
SHBG Testis-specific androgen-binding protein
Type:
PROTEIN
Mol. Mass.:
43780.19
Organism:
Homo sapiens (Human)
Description:
ChEMBL_466706
Residue:
402
  
Inhibitor
Name:
BDBM50423506
Synonyms:
4-Tert-Octylphenol P-T-Octylphenol
Type:
Small organic molecule
Emp. Form.:
C14H22O
Mol. Mass.:
206.3239
SMILES:
CC(C)(C)CC(C)(C)c1ccc(O)cc1
: