Target
Sex hormone-binding globulin
Ligand
BDBM50423512
Substrate
Meas. Tech.
ChEMBL_466706 (CHEMBL922711)
Kd
30±n/a nM
Citation
 Cherkasov, ABan, FSantos-Filho, OThorsteinson, NFallahi, MHammond, GL An updated steroid benchmark set and its application in the discovery of novel nanomolar ligands of sex hormone-binding globulin. J Med Chem 51:2047-56 (2008)  
Target
Name:
Sex hormone-binding globulin
Synonyms:
SHBG Testis-specific androgen-binding protein
Type:
PROTEIN
Mol. Mass.:
43780.19
Organism:
Homo sapiens (Human)
Description:
ChEMBL_466706
Residue:
402
  
Inhibitor
Name:
BDBM50423512
Synonyms:
CHEMBL260341
Type:
Small organic molecule
Emp. Form.:
C25H43NO2
Mol. Mass.:
389.6144
SMILES:
C[C@]12CC[C@H]3[C@@H](CC[C@H]4CC(=O)C[C@H](CCCCCCN)[C@]34C)[C@@H]1CC[C@@H]2O
: