Target
Albumin
Ligand
BDBM25761
Substrate
Meas. Tech.
ChEMBL_475203 (CHEMBL925744)
Kd
660693±n/a nM
Citation
 Lázaro, ELowe, PJBriand, XFaller, B New approach to measure protein binding based on a parallel artificial membrane assay and human serum albumin. J Med Chem 51:2009-17 (2008)  
Target
Name:
Albumin
Synonyms:
ALB Serum albumin
Type:
PROTEIN
Mol. Mass.:
69362.94
Organism:
Homo sapiens (Human)
Description:
ChEMBL_1509401
Residue:
609
  
Inhibitor
Name:
BDBM25761
Synonyms:
Anapriline CHEMBL27 PROPRANOLOL, d PROPRANOLOL,(+) Propanolol Propranolol | [2-hydroxy-3-(naphthalen-1-yloxy)propyl](propan-2-yl)amine
Type:
Small organic molecule
Emp. Form.:
C16H21NO2
Mol. Mass.:
259.3434
SMILES:
CC(C)NCC(O)COc1cccc2ccccc12
: