Target
Cyclin-dependent kinase/G2/mitotic-specific cyclin- 1
Ligand
BDBM50423759
Substrate
Meas. Tech.
ChEMBL_612597 (CHEMBL1064247)
Ki
98±n/a nM
Citation
 McIntyre, NAMcInnes, CGriffiths, GBarnett, ALKontopidis, GSlawin, AMJackson, WThomas, MZheleva, DIWang, SBlake, DGWestwood, NJFischer, PM Design, synthesis, and evaluation of 2-methyl- and 2-amino-N-aryl-4,5-dihydrothiazolo[4,5-h]quinazolin-8-amines as ring-constrained 2-anilino-4-(thiazol-5-yl)pyrimidine cyclin-dependent kinase inhibitors. J Med Chem 53:2136-45 (2010)  
Target
Name:
Cyclin-dependent kinase/G2/mitotic-specific cyclin- 1
Synonyms:
CDK1/B CDK1/CyclinB Cyclin-Dependent Kinase 1 (CDK1) Cyclin-dependent kinase/G2/mitotic-specific cyclin 1 | cdk1
Type:
Protein Complex
Mol. Mass.:
Description:
CDK1/Cyclin B complexes were purified from insect cells co-infected with baculovirus vectors containing each of the components.
Components:
This complex has 2 components.
Component 1
Name:
Cyclin-dependent kinase 1
Synonyms:
CDC2 CDK1 CDKN1 Cell division protein kinase 1 P34CDC2 | p34 protein kinase
Type:
Enzyme Subunit
Mol. Mass.:
34101.08
Organism:
Homo sapiens (Human)
Description:
P06493
Residue:
297
  
Component 2
Name:
G2/mitotic-specific cyclin-B1
Synonyms:
CCNB CCNB1_HUMAN
Type:
Enzyme Subunit
Mol. Mass.:
48340.95
Organism:
Homo sapiens (Human)
Description:
P14635
Residue:
433
  
Inhibitor
Name:
BDBM50423759
Synonyms:
CHEMBL598166
Type:
Small organic molecule
Emp. Form.:
C17H18N6S
Mol. Mass.:
338.43
SMILES:
CN(C)c1ccc(Nc2ncc3CCc4nc(N)sc4-c3n2)cc1
: