Target
Cyclin-H/Cyclin-dependent kinase 7
Ligand
BDBM50423754
Substrate
Meas. Tech.
ChEMBL_612600 (CHEMBL1064250)
Ki
140±n/a nM
Citation
 McIntyre, NAMcInnes, CGriffiths, GBarnett, ALKontopidis, GSlawin, AMJackson, WThomas, MZheleva, DIWang, SBlake, DGWestwood, NJFischer, PM Design, synthesis, and evaluation of 2-methyl- and 2-amino-N-aryl-4,5-dihydrothiazolo[4,5-h]quinazolin-8-amines as ring-constrained 2-anilino-4-(thiazol-5-yl)pyrimidine cyclin-dependent kinase inhibitors. J Med Chem 53:2136-45 (2010)  
Target
Name:
Cyclin-H/Cyclin-dependent kinase 7
Synonyms:
CDK-activating kinase assembly factor MAT1/Cyclin H/Cyclin-dependent kinase 7 CDK7/H Cyclin-Dependent Kinase 7 (CDK7) Cyclin-dependent kinase 7/cyclin H
Type:
Protein Complex
Mol. Mass.:
Description:
Components:
This complex has 2 components.
Component 1
Name:
Cyclin-H
Synonyms:
CCNH Cyclin H p34 | p37
Type:
Enzyme Subunit
Mol. Mass.:
37646.05
Organism:
Homo sapiens (Human)
Description:
Residue:
323
  
Component 2
Name:
Cyclin-dependent kinase 7
Synonyms:
39 kDa protein kinase CAK1 CDK-activating kinase 1 (CAK) CDK7_HUMAN Cell division protein kinase 7 Cyclin-dependent kinase 7 (CDK7/cyclin H) P39 Mo15 TFIIH basal transcription factor complex kinase subunit
Type:
Enzyme Subunit
Mol. Mass.:
39047.01
Organism:
Homo sapiens (Human)
Description:
Residue:
346
  
Inhibitor
Name:
BDBM50423754
Synonyms:
CHEMBL598992
Type:
Small organic molecule
Emp. Form.:
C15H12N6O2S
Mol. Mass.:
340.36
SMILES:
Nc1nc2CCc3cnc(Nc4cccc(c4)[N+]([O-])=O)nc3-c2s1
: