Target
Beta-3 adrenergic receptor
Ligand
BDBM25764
Substrate
Meas. Tech.
ChEMBL_770403 (CHEMBL1833712)
Kd
76±n/a nM
Citation
 Baker, JGAdams, LASalchow, KMistry, SNMiddleton, RJHill, SJKellam, B Synthesis and characterization of high-affinity 4,4-difluoro-4-bora-3a,4a-diaza-s-indacene-labeled fluorescent ligands for humanß-adrenoceptors. J Med Chem 54:6874-87 (2011)  
Target
Name:
Beta-3 adrenergic receptor
Synonyms:
ADRB3 ADRB3_HUMAN Beta-2 adrenergic receptor and beta-3 adrenergic receptor Beta-3 adrenoreceptor | adrenergic Beta3
Type:
G Protein-Coupled Receptor (GPCR)
Mol. Mass.:
43534.88
Organism:
Homo sapiens (Human)
Description:
Residue:
408
  
Inhibitor
Name:
BDBM25764
Synonyms:
ALPRENOLOL,(+) Alfeprol Alprenolol {2-hydroxy-3-[2-(prop-2-en-1-yl)phenoxy]propyl}(propan-2-yl)amine
Type:
Small organic molecule
Emp. Form.:
C15H23NO2
Mol. Mass.:
249.3486
SMILES:
CC(C)NCC(O)COc1ccccc1CC=C
: