Target
Xanthine dehydrogenase/oxidase
Ligand
BDBM50423928
Substrate
Meas. Tech.
ChEMBL_935552 (CHEMBL2320088)
IC50
34200±n/a nM
Citation
 Mandawad, GGDawane, BSBeedkar, SDKhobragade, CNYemul, OS Trisubstituted thiophene analogues of 1-thiazolyl-2-pyrazoline, super oxidase inhibitors and free radical scavengers. Bioorg Med Chem 21:365-72 (2012)  
Target
Name:
Xanthine dehydrogenase/oxidase
Synonyms:
XD XO Xanthine oxidase Xdh
Type:
PROTEIN
Mol. Mass.:
146252.77
Organism:
Rattus norvegicus
Description:
ChEMBL_1296864
Residue:
1331
  
Inhibitor
Name:
BDBM50423928
Synonyms:
CHEMBL2313035
Type:
Small organic molecule
Emp. Form.:
C22H15Cl3N4O2S3
Mol. Mass.:
569.934
SMILES:
NS(=O)(=O)c1sc(Cl)cc1C1=NN(C(C1)c1ccc(Cl)cc1)c1nc(cs1)-c1ccc(Cl)cc1
: