Target
Tissue factor
Ligand
BDBM50424069
Substrate
Meas. Tech.
ChEMBL_936735 (CHEMBL2319887)
IC50
1501±n/a nM
Citation
 Ge, HXZhang, JChen, LKou, JPYu, BY Chemical and microbial semi-synthesis of tetrahydroprotoberberines as inhibitors on tissue factor procoagulant activity. Bioorg Med Chem 21:62-9 (2012)  
Target
Name:
Tissue factor
Synonyms:
CD_antigen=CD142 Coagulation factor VII/tissue factor TF Thromboplastin | Tissue factor
Type:
PROTEIN
Mol. Mass.:
33067.61
Organism:
Homo sapiens (Human)
Description:
ChEMBL_936735
Residue:
295
  
Inhibitor
Name:
BDBM50424069
Synonyms:
CHEMBL2314736
Type:
Small organic molecule
Emp. Form.:
C25H29NO5
Mol. Mass.:
423.5015
SMILES:
CCCCCC(=O)Oc1c(OC)ccc2CC3N(CCc4cc5OCOc5cc34)Cc12
: