Target
Tissue factor
Ligand
BDBM50424072
Substrate
Meas. Tech.
ChEMBL_936735 (CHEMBL2319887)
IC50
6.8±n/a nM
Citation
 Ge, HXZhang, JChen, LKou, JPYu, BY Chemical and microbial semi-synthesis of tetrahydroprotoberberines as inhibitors on tissue factor procoagulant activity. Bioorg Med Chem 21:62-9 (2012)  
Target
Name:
Tissue factor
Synonyms:
CD_antigen=CD142 Coagulation factor VII/tissue factor TF Thromboplastin | Tissue factor
Type:
PROTEIN
Mol. Mass.:
33067.61
Organism:
Homo sapiens (Human)
Description:
ChEMBL_936735
Residue:
295
  
Inhibitor
Name:
BDBM50424072
Synonyms:
CHEMBL2314733 | R-(+)-Tetrahydroberberrubine
Type:
Small organic molecule
Emp. Form.:
C19H19NO4
Mol. Mass.:
325.3585
SMILES:
COc1ccc2C[C@H]3N(CCc4cc5OCOc5cc34)Cc2c1O
: