Target
Muscarinic acetylcholine receptor M1
Ligand
BDBM50263887
Substrate
Meas. Tech.
ChEMBL_937313 (CHEMBL2319076)
Ki
600±n/a nM
Citation
 Sheffler, DJSevel, CLe, ULovell, KMTarr, JCCarrington, SJCho, HPDigby, GJNiswender, CMConn, PJHopkins, CRWood, MRLindsley, CW Further exploration of M1 allosteric agonists: subtle structural changes abolish M1 allosteric agonism and result in pan-mAChR orthosteric antagonism. Bioorg Med Chem Lett 23:223-7 (2012)  
Target
Name:
Muscarinic acetylcholine receptor M1
Synonyms:
ACM1_RAT Chrm-1 cholinergic receptor, muscarinic 1
Type:
Enzyme Catalytic Domain
Mol. Mass.:
51390.46
Organism:
RAT
Description:
P08482
Residue:
460
  
Inhibitor
Name:
BDBM50263887
Synonyms:
1-(1'-(2-methylbenzyl)-1,4'-bipiperidin-4-yl)-1H-benzo[d]imidazol-2(3H)-one CHEMBL522460
Type:
Small organic molecule
Emp. Form.:
C25H32N4O
Mol. Mass.:
404.5478
SMILES:
Cc1ccccc1CN1CCC(CC1)N1CCC(CC1)n1c2ccccc2[nH]c1=O
: