Target
Bcl-2-like protein 1
Ligand
BDBM50424206
Substrate
Meas. Tech.
ChEMBL_934032 (CHEMBL2318339)
IC50
53±n/a nM
Citation
 Song, TLi, XChang, XLiang, XZhao, YWu, GXie, SSu, PWu, ZFeng, YZhang, Z 3-Thiomorpholin-8-oxo-8H-acenaphtho [1,2-b] pyrrole-9-carbonitrile (S1) derivatives as pan-Bcl-2-inhibitors of Bcl-2, Bcl-xL and Mcl-1. Bioorg Med Chem 21:11-20 (2012)  
Target
Name:
Bcl-2-like protein 1
Synonyms:
Anti-apoptotic Bcl-2 protein Apoptosis regulator Bcl-X BCL2-like 1 isoform 1 BCL2L1 Bcl-2-like protein 1 (Bcl-XL) Bcl-xL/Bcl-2-binding component 3 Bcl2-antagonist of cell death (BAD)
Type:
Mitochondrion membrane; Single-pass membrane protein
Mol. Mass.:
26039.60
Organism:
Homo sapiens (Human)
Description:
Residue:
233
  
Inhibitor
Name:
BDBM50424206
Synonyms:
CHEMBL2312473
Type:
Small organic molecule
Emp. Form.:
C29H22N2O3S
Mol. Mass.:
478.562
SMILES:
OOc1ccc(Sc2ccc3c4c(NCCCc5ccccc5)c(=O)nc4c4cccc2c34)cc1
: