Target
Apoptosis regulator Bcl-2
Ligand
BDBM50424219
Substrate
Meas. Tech.
ChEMBL_934034 (CHEMBL2318341)
IC50
>10000±n/a nM
Citation
 Song, TLi, XChang, XLiang, XZhao, YWu, GXie, SSu, PWu, ZFeng, YZhang, Z 3-Thiomorpholin-8-oxo-8H-acenaphtho [1,2-b] pyrrole-9-carbonitrile (S1) derivatives as pan-Bcl-2-inhibitors of Bcl-2, Bcl-xL and Mcl-1. Bioorg Med Chem 21:11-20 (2012)  
Target
Name:
Apoptosis regulator Bcl-2
Synonyms:
Apoptosis regulator Bcl-2 Protein BCL-2 BCL2_HUMAN | Bcl-2 Protein
Type:
Homodimer or heterodimer
Mol. Mass.:
26269.11
Organism:
Homo sapiens (Human)
Description:
P10415
Residue:
239
  
Inhibitor
Name:
BDBM50424219
Synonyms:
CHEMBL2312478
Type:
Small organic molecule
Emp. Form.:
C21H21N3OS
Mol. Mass.:
363.476
SMILES:
CC(C)Nc1c2c3ccc(N4CCSCC4)c4cccc(c2nc1=O)c34
: