Target
Glucose-dependent insulinotropic receptor
Ligand
BDBM50424569
Substrate
Meas. Tech.
ChEMBL_933672 (CHEMBL2320533)
Ki
163±n/a nM
Citation
 Darout, ERobinson, RPMcClure, KFCorbett, MLi, BShavnya, AAndrews, MPJones, CSLi, QMinich, MLMascitti, VGuimarães, CRMunchhof, MJBahnck, KBCai, CPrice, DALiras, SBonin, PDCornelius, PWang, RBagdasarian, VSobota, CPHornby, SMasterson, VMJoseph, RMKalgutkar, ASChen, Y Design and synthesis of diazatricyclodecane agonists of the G-protein-coupled receptor 119. J Med Chem 56:301-19 (2013)  
Target
Name:
Glucose-dependent insulinotropic receptor
Synonyms:
G-protein coupled receptor 119 (GPR119) GPR119 | Glucose-dependent insulinotropic receptor
Type:
Protein
Mol. Mass.:
36901.49
Organism:
Homo sapiens (Human)
Description:
Q8TDV5
Residue:
335
  
Inhibitor
Name:
BDBM50424569
Synonyms:
CHEMBL2312511
Type:
Small organic molecule
Emp. Form.:
C24H31N5O4
Mol. Mass.:
453.534
SMILES:
COc1c(Oc2cccnc2C)ncnc1N1C2CC3CC1CC(C2)N3C(=O)OC(C)(C)C
: