Target
Egl nine homolog 1
Ligand
BDBM26106
Substrate
Meas. Tech.
ChEMBL_934089 (CHEMBL2318591)
IC50
20000±n/a nM
Citation
 Leung, IKDemetriades, MHardy, APLejeune, CSmart, TJSzöllössi, AKawamura, ASchofield, CJClaridge, TD Reporter ligand NMR screening method for 2-oxoglutarate oxygenase inhibitors. J Med Chem 56:547-55 (2013)  
Target
Name:
Egl nine homolog 1
Synonyms:
C1orf12 EGLN1_HUMAN Hypoxia-inducible factor prolyl hydroxylase 2 (HIF-PH2) Prolyl hydroxylase domain-containing protein 2 (PHD2)
Type:
Protein
Mol. Mass.:
46035.59
Organism:
Homo sapiens (Human)
Description:
Q9GZT9
Residue:
426
  
Inhibitor
Name:
BDBM26106
Synonyms:
CHEMBL90852 NOG [(carboxymethyl)carbamoyl]formic acid
Type:
Small organic molecule
Emp. Form.:
C4H5NO5
Mol. Mass.:
147.0862
SMILES:
OC(=O)CNC(=O)C(O)=O
: