Target
Induced myeloid leukemia cell differentiation protein Mcl-1
Ligand
BDBM50424730
Substrate
Meas. Tech.
ChEMBL_934321 (CHEMBL2320307)
Ki
180±n/a nM
Citation
 Friberg, AVigil, DZhao, BDaniels, RNBurke, JPGarcia-Barrantes, PMCamper, DChauder, BALee, TOlejniczak, ETFesik, SW Discovery of potent myeloid cell leukemia 1 (Mcl-1) inhibitors using fragment-based methods and structure-based design. J Med Chem 56:15-30 (2013)  
Target
Name:
Induced myeloid leukemia cell differentiation protein Mcl-1
Synonyms:
BCL2L3 Bcl-2-like protein 3 (Mcl-1) Bcl2-L-3 MCL1 Mcl-1 Myeloid cell leukemia sequence 1 (BCL2-related) | mcl1/EAT
Type:
Membrane; Single-pass membrane protein
Mol. Mass.:
37332.87
Organism:
Homo sapiens (Human)
Description:
Q07820
Residue:
350
  
Inhibitor
Name:
BDBM50424730
Synonyms:
CHEMBL2314503
Type:
Small organic molecule
Emp. Form.:
C21H22ClNO3
Mol. Mass.:
371.857
SMILES:
Cc1cc(OCCCc2c(C(O)=O)n(C)c3ccccc23)cc(C)c1Cl
: