Target
Cyclin-dependent kinase 4
Ligand
BDBM50027825
Substrate
Meas. Tech.
ChEMBL_936302 (CHEMBL2321000)
Ki
<100±n/a nM
Citation
 Hole, AJBaumli, SShao, HShi, SHuang, SPepper, CFischer, PMWang, SEndicott, JANoble, ME Comparative structural and functional studies of 4-(thiazol-5-yl)-2-(phenylamino)pyrimidine-5-carbonitrile CDK9 inhibitors suggest the basis for isotype selectivity. J Med Chem 56:660-70 (2013)  
Target
Name:
Cyclin-dependent kinase 4
Synonyms:
CDK4 Cell division protein kinase 4 PSK-J3
Type:
Enzyme Subunit
Mol. Mass.:
33731.96
Organism:
Homo sapiens (Human)
Description:
P11802
Residue:
303
  
Inhibitor
Name:
BDBM50027825
Synonyms:
CHEMBL2312181
Type:
Small organic molecule
Emp. Form.:
C21H21NO5
Mol. Mass.:
367.3951
SMILES:
CN1CCC(C1CO)c1c(O)cc(O)c2c1oc(cc2=O)-c1ccccc1
: