Target
Neuronal acetylcholine receptor subunit alpha-7
Ligand
BDBM50425040
Substrate
Meas. Tech.
ChEMBL_936603 (CHEMBL2318766)
Ki
>1000000±n/a nM
Citation
 Ussing, CAHansen, CPPetersen, JGJensen, AARohde, LAAhring, PKNielsen, EŘKastrup, JSGajhede, MFrølund, BBalle, T Synthesis, pharmacology, and biostructural characterization of novela4ß2 nicotinic acetylcholine receptor agonists. J Med Chem 56:940-51 (2013)  
Target
Name:
Neuronal acetylcholine receptor subunit alpha-7
Synonyms:
ACHA7_RAT Cholinergic, Nicotinic Alpha7 Chrna7 Neuronal acetylcholine receptor (alpha7 nAChR) Neuronal acetylcholine receptor subunit alpha-7 Neuronal acetylcholine receptor subunit alpha-7 (nAChR)
Type:
Enzyme
Mol. Mass.:
56502.44
Organism:
Rattus norvegicus (Rat)
Description:
Q05941
Residue:
502
  
Inhibitor
Name:
BDBM50425040
Synonyms:
CHEMBL2312564
Type:
Small organic molecule
Emp. Form.:
C11H21N3O
Mol. Mass.:
211.3039
SMILES:
C[C@H](CCOc1nc(C)cn1C)N(C)C
: