Target
Gastrin-releasing peptide receptor
Ligand
BDBM85484
Substrate
Meas. Tech.
ChEMBL_933748 (CHEMBL2320850)
IC50
2.0±n/a nM
Citation
 Shrivastava, AWang, SHRaju, NGierach, IDing, HTweedle, MF Heterobivalent dual-target probe for targeting GRP and Y1 receptors on tumor cells. Bioorg Med Chem Lett 23:687-92 (2013)  
Target
Name:
Gastrin-releasing peptide receptor
Synonyms:
Bombesin 2 GRP-preferring bombesin receptor GRPR_HUMAN Gastrin-releasing peptide receptor
Type:
Enzyme Catalytic Domain
Mol. Mass.:
43214.53
Organism:
Homo sapiens (Human)
Description:
Bombesin 2 GRPR 0::P30550
Residue:
384
  
Inhibitor
Name:
BDBM85484
Synonyms:
Bombesin
Type:
Small organic molecule
Emp. Form.:
C71H110N24O18S
Mol. Mass.:
1619.848
SMILES:
CSCC[C@H](NC(=O)[C@H](CC(C)C)NC(=O)[C@H](Cc1cnc[nH]1)NC(=O)CNC(=O)[C@@H](NC(=O)[C@H](C)NC(=O)[C@H](Cc1c[nH]c2ccccc12)NC(=O)[C@H](CCC(N)=O)NC(=O)[C@H](CC(N)=O)NC(=O)CNC(=O)[C@H](CC(C)C)NC(=O)[C@H](CCCN=C(N)N)NC(=O)[C@H](CCC(N)=O)NC(=O)[C@@H]1CCC(=O)N1)C(C)C)C(N)=O
: