Target
Acyl-CoA desaturase 1
Ligand
BDBM50425256
Substrate
Meas. Tech.
ChEMBL_933806 (CHEMBL2321360)
IC50
1.000000±n/a nM
Citation
 Deng, YYang, ZShipps, GWLo, SMWest, RHwa, JZheng, SFarley, CLachowicz, Jvan Heek, MBass, ASSinha, DPMahon, CRCartwright, ME Discovery of liver-targeted inhibitors of stearoyl-CoA desaturase (SCD1). Bioorg Med Chem Lett 23:791-6 (2013)  
Target
Name:
Acyl-CoA desaturase 1
Synonyms:
ACOD1_RAT Scd Stearoyl-CoA desaturase 1 (SCD1)
Type:
Enzyme
Mol. Mass.:
41485.97
Organism:
Rattus norvegicus (Rat)
Description:
P07308
Residue:
358
  
Inhibitor
Name:
BDBM50425256
Synonyms:
CHEMBL2315179
Type:
Small organic molecule
Emp. Form.:
C25H23F3N4OS
Mol. Mass.:
484.537
SMILES:
FC(F)(F)c1cccc(CN2CCC3(CCN(CC3)c3ncc(s3)C#N)Oc3ccccc23)c1
: