Target
Prostaglandin G/H synthase 2
Ligand
BDBM50425316
Substrate
Meas. Tech.
ChEMBL_933841 (CHEMBL2321395)
IC50
76600±n/a nM
Citation
 Kablaoui, NPatel, SShao, JDemian, DHoffmaster, KBerlioz, FVazquez, MLMoore, WMNugent, RA Novel benzoxazole inhibitors of mPGES-1. Bioorg Med Chem Lett 23:907-11 (2013)  
Target
Name:
Prostaglandin G/H synthase 2
Synonyms:
COX2 Cyclooxygenase 2 (COX-2) Cyclooxygenase-2 (COX-2 AA) Cyclooxygenase-2 (COX-2) PGH2_HUMAN PHS II Prostaglandin E synthase/G/H synthase 2 Prostaglandin-endoperoxide synthase 2
Type:
Enzyme
Mol. Mass.:
69003.89
Organism:
Homo sapiens (Human)
Description:
Recombinant Cox-2 provided by Cayman (Cayman Chemical Co.,Ann Arbor, MI).
Residue:
604
  
Inhibitor
Name:
BDBM50425316
Synonyms:
CHEMBL2315855
Type:
Small organic molecule
Emp. Form.:
C25H28ClN3O3
Mol. Mass.:
453.961
SMILES:
Clc1ccc2oc(nc2c1)N1CCC(CC1)C(=O)N[C@H]1CCC[C@H]1OCc1ccccc1
: