Target
Prostaglandin E synthase
Ligand
BDBM50425318
Substrate
Meas. Tech.
ChEMBL_933843 (CHEMBL2321397)
IC50
383±n/a nM
Citation
 Kablaoui, NPatel, SShao, JDemian, DHoffmaster, KBerlioz, FVazquez, MLMoore, WMNugent, RA Novel benzoxazole inhibitors of mPGES-1. Bioorg Med Chem Lett 23:907-11 (2013)  
Target
Name:
Prostaglandin E synthase
Synonyms:
MGST1L1 PGES PTGES Prostaglandin E synthase (PGES-1) Prostaglandin E synthase-1 (PGES-1) Prostaglandin E2 synthase-1 ( mPGES-1)
Type:
Protein
Mol. Mass.:
17112.22
Organism:
Homo sapiens (Human)
Description:
Residue:
152
  
Inhibitor
Name:
BDBM50425318
Synonyms:
CHEMBL2315861
Type:
Small organic molecule
Emp. Form.:
C20H26ClN3O3
Mol. Mass.:
391.892
SMILES:
OC[C@H]1CC[C@H](CC1)NC(=O)C1CCN(CC1)c1nc2cc(Cl)ccc2o1
: