Target
Prostaglandin E synthase
Ligand
BDBM50425328
Substrate
Meas. Tech.
ChEMBL_933843 (CHEMBL2321397)
IC50
242±n/a nM
Citation
 Kablaoui, NPatel, SShao, JDemian, DHoffmaster, KBerlioz, FVazquez, MLMoore, WMNugent, RA Novel benzoxazole inhibitors of mPGES-1. Bioorg Med Chem Lett 23:907-11 (2013)  
Target
Name:
Prostaglandin E synthase
Synonyms:
MGST1L1 PGES PTGES Prostaglandin E synthase (PGES-1) Prostaglandin E synthase-1 (PGES-1) Prostaglandin E2 synthase-1 ( mPGES-1)
Type:
Protein
Mol. Mass.:
17112.22
Organism:
Homo sapiens (Human)
Description:
Residue:
152
  
Inhibitor
Name:
BDBM50425328
Synonyms:
CHEMBL2315867
Type:
Small organic molecule
Emp. Form.:
C19H24ClN3O2
Mol. Mass.:
361.866
SMILES:
CC1CCCC1NC(=O)C1CCN(CC1)c1nc2cc(Cl)ccc2o1
: