Target
Tyrosine-protein kinase ABL1
Ligand
BDBM50425385
Substrate
Meas. Tech.
ChEMBL_934834 (CHEMBL2319227)
Kd
9.4±n/a nM
Citation
 Duveau, DYHu, XWalsh, MJShukla, SSkoumbourdis, APBoxer, MBAmbudkar, SVShen, MThomas, CJ Synthesis and biological evaluation of analogues of the kinase inhibitor nilotinib as Abl and Kit inhibitors. Bioorg Med Chem Lett 23:682-6 (2013)  
Target
Name:
Tyrosine-protein kinase ABL1
Synonyms:
ABL ABL1_HUMAN JTK7 Proto-oncogene tyrosine-protein kinase ABL1 Tyrosine-protein kinase ABL V-abl Abelson murine leukemia viral oncogene homolog 1 p150 | tyrosine-protein kinase ABL1 isoform a
Type:
Enzyme
Mol. Mass.:
122897.30
Organism:
Homo sapiens (Human)
Description:
P00519
Residue:
1130
  
Inhibitor
Name:
BDBM50425385
Synonyms:
CHEMBL2311807
Type:
Small organic molecule
Emp. Form.:
C27H22FN7O
Mol. Mass.:
479.5083
SMILES:
Cc1cn(cn1)-c1cc(F)cc(NC(=O)c2ccc(C)c(Nc3nccc(n3)-c3cccnc3)c2)c1
: