Target
Platelet-derived growth factor receptor alpha
Ligand
BDBM50425387
Substrate
Meas. Tech.
ChEMBL_934836 (CHEMBL2319489)
IC50
8.2±n/a nM
Citation
 Duveau, DYHu, XWalsh, MJShukla, SSkoumbourdis, APBoxer, MBAmbudkar, SVShen, MThomas, CJ Synthesis and biological evaluation of analogues of the kinase inhibitor nilotinib as Abl and Kit inhibitors. Bioorg Med Chem Lett 23:682-6 (2013)  
Target
Name:
Platelet-derived growth factor receptor alpha
Synonyms:
Alpha-type platelet-derived growth factor receptor PDGFRA PGFRA_HUMAN Platelet-derived growth factor receptor alpha (PDGFRA) RHEPDGFRA
Type:
Protein
Mol. Mass.:
122633.38
Organism:
Homo sapiens (Human)
Description:
P16234
Residue:
1089
  
Inhibitor
Name:
BDBM50425387
Synonyms:
CHEMBL2311806
Type:
Small organic molecule
Emp. Form.:
C28H25N7O
Mol. Mass.:
475.5444
SMILES:
Cc1cn(cn1)-c1cc(C)cc(NC(=O)c2ccc(C)c(Nc3nccc(n3)-c3cccnc3)c2)c1
: