Target
Discoidin domain-containing receptor 2
Ligand
BDBM50425386
Substrate
Meas. Tech.
ChEMBL_934841 (CHEMBL2319494)
IC50
653±n/a nM
Citation
 Duveau, DYHu, XWalsh, MJShukla, SSkoumbourdis, APBoxer, MBAmbudkar, SVShen, MThomas, CJ Synthesis and biological evaluation of analogues of the kinase inhibitor nilotinib as Abl and Kit inhibitors. Bioorg Med Chem Lett 23:682-6 (2013)  
Target
Name:
Discoidin domain-containing receptor 2
Synonyms:
DDR2 Discoidin domain receptor 2 (DDR2) Discoidin domain-containing receptor 2 (DDR2) NTRKR3 TYRO10
Type:
Protein
Mol. Mass.:
96717.07
Organism:
Homo sapiens (Human)
Description:
Q16832
Residue:
855
  
Inhibitor
Name:
BDBM50425386
Synonyms:
CHEMBL2311808
Type:
Small organic molecule
Emp. Form.:
C27H23N7O
Mol. Mass.:
461.5178
SMILES:
Cc1cn(cn1)-c1cccc(NC(=O)c2ccc(C)c(Nc3nccc(n3)-c3cccnc3)c2)c1
: