Target
Amine oxidase [flavin-containing] B
Ligand
BDBM50425493
Substrate
Meas. Tech.
ChEMBL_935779 (CHEMBL2317359)
IC50
>1000±n/a nM
Citation
 Rivara, SPiersanti, GBartoccini, FDiamantini, GPala, DRiccioni, TStasi, MACabri, WBorsini, FMor, MTarzia, GMinetti, P Synthesis of (E)-8-(3-chlorostyryl)caffeine analogues leading to 9-deazaxanthine derivatives as dual A(2A) antagonists/MAO-B inhibitors. J Med Chem 56:1247-61 (2013)  
Target
Name:
Amine oxidase [flavin-containing] B
Synonyms:
AOFB_HUMAN MAOB Monoamine oxidase type B (MAO B) Monoamine oxidase type B (MAOB)
Type:
Protein
Mol. Mass.:
58768.76
Organism:
Homo sapiens (Human)
Description:
P27338
Residue:
520
  
Inhibitor
Name:
BDBM50425493
Synonyms:
CHEMBL2312983
Type:
Small organic molecule
Emp. Form.:
C18H18ClN3O2
Mol. Mass.:
343.807
SMILES:
CCn1c(\C=C\c2ccc(Cl)cc2)cc2n(C)c(=O)n(C)c(=O)c12
: