Target
Amine oxidase [flavin-containing] B
Ligand
BDBM50425477
Substrate
Meas. Tech.
ChEMBL_935779 (CHEMBL2317359)
IC50
430±n/a nM
Citation
 Rivara, SPiersanti, GBartoccini, FDiamantini, GPala, DRiccioni, TStasi, MACabri, WBorsini, FMor, MTarzia, GMinetti, P Synthesis of (E)-8-(3-chlorostyryl)caffeine analogues leading to 9-deazaxanthine derivatives as dual A(2A) antagonists/MAO-B inhibitors. J Med Chem 56:1247-61 (2013)  
Target
Name:
Amine oxidase [flavin-containing] B
Synonyms:
AOFB_HUMAN MAOB Monoamine oxidase type B (MAO B) Monoamine oxidase type B (MAOB)
Type:
Protein
Mol. Mass.:
58768.76
Organism:
Homo sapiens (Human)
Description:
P27338
Residue:
520
  
Inhibitor
Name:
BDBM50425477
Synonyms:
(E)-8-(4-Chlorostyryl)caffeine (4a) | CHEMBL2313284
Type:
Small organic molecule
Emp. Form.:
C16H15ClN4O2
Mol. Mass.:
330.769
SMILES:
Cn1c(\C=C\c2ccc(Cl)cc2)nc2n(C)c(=O)n(C)c(=O)c12
: