Target
Adenosine receptor A2a
Ligand
BDBM50041581
Substrate
Meas. Tech.
ChEMBL_935780 (CHEMBL2317360)
Ki
170±n/a nM
Citation
 Rivara, SPiersanti, GBartoccini, FDiamantini, GPala, DRiccioni, TStasi, MACabri, WBorsini, FMor, MTarzia, GMinetti, P Synthesis of (E)-8-(3-chlorostyryl)caffeine analogues leading to 9-deazaxanthine derivatives as dual A(2A) antagonists/MAO-B inhibitors. J Med Chem 56:1247-61 (2013)  
Target
Name:
Adenosine receptor A2a
Synonyms:
A2A adenosine receptor (hA2A) ADENOSINE A2 ADORA2 Adenosine A2A receptor (A2AAR)
Type:
G Protein-Coupled Receptor (GPCR)
Mol. Mass.:
44716.46
Organism:
Homo sapiens (Human)
Description:
P29274
Residue:
412
  
Inhibitor
Name:
BDBM50041581
Synonyms:
1,3,5-Trimethyl-6-((E)-styryl)-1,5-dihydro-pyrrolo[3,2-d]pyrimidine-2,4-dione | CHEMBL39898
Type:
Small organic molecule
Emp. Form.:
C17H17N3O2
Mol. Mass.:
295.3358
SMILES:
Cn1c(\C=C\c2ccccc2)cc2n(C)c(=O)n(C)c(=O)c12
: