Target
Galectin-1
Ligand
BDBM50425514
Substrate
Meas. Tech.
ChEMBL_936060 (CHEMBL2319302)
Kd
6700±n/a nM
Citation
 van Hattum, HBranderhorst, HMMoret, EENilsson, UJLeffler, HPieters, RJ Tuning the preference of thiodigalactoside- and lactosamine-based ligands to galectin-3 over galectin-1. J Med Chem 56:1350-4 (2013)  
Target
Name:
Galectin-1
Synonyms:
14 kDa lectin HPL LGALS1 Lectin galactoside-binding soluble 1 | Putative MAPK-activating protein PM12
Type:
beta galactoside-binding protein
Mol. Mass.:
14713.53
Organism:
Homo sapiens (Human)
Description:
P09382
Residue:
135
  
Inhibitor
Name:
BDBM50425514
Synonyms:
CHEMBL2313334
Type:
Small organic molecule
Emp. Form.:
C36H41N7O11
Mol. Mass.:
747.751
SMILES:
OC[C@H]1O[C@@H](O[C@@H]2[C@@H](CO)O[C@@H](OCCCN=[N+]=[N-])[C@H](NC(=O)c3ccccc3)[C@H]2O)[C@H](O)[C@H]([C@H]1O)n1cc(nn1)-c1ccc(Oc2ccccc2)cc1
: