Target
Galectin-1
Ligand
BDBM50077225
Substrate
Meas. Tech.
ChEMBL_936060 (CHEMBL2319302)
Kd
24000±n/a nM
Citation
 van Hattum, HBranderhorst, HMMoret, EENilsson, UJLeffler, HPieters, RJ Tuning the preference of thiodigalactoside- and lactosamine-based ligands to galectin-3 over galectin-1. J Med Chem 56:1350-4 (2013)  
Target
Name:
Galectin-1
Synonyms:
14 kDa lectin HPL LGALS1 Lectin galactoside-binding soluble 1 | Putative MAPK-activating protein PM12
Type:
beta galactoside-binding protein
Mol. Mass.:
14713.53
Organism:
Homo sapiens (Human)
Description:
P09382
Residue:
135
  
Inhibitor
Name:
BDBM50077225
Synonyms:
(2R,3R,4S,5R,6S)-2-(hydroxymethyl)-6-{[(2S,3R,4S,5R,6R)-3,4,5-trihydroxy-6-(hydroxymethyl)tetrahydro-2H-pyran-2-yl]thio}tetrahydro-2H-pyran-3,4,5-triol THIODIGALACTOSIDE
Type:
Small organic molecule
Emp. Form.:
C12H22O10S
Mol. Mass.:
358.362
SMILES:
OC[C@H]1O[C@@H](S[C@@H]2O[C@H](CO)[C@H](O)[C@H](O)[C@H]2O)[C@H](O)[C@@H](O)[C@H]1O
: