Target
MAP kinase-activated protein kinase 2
Ligand
BDBM50425862
Substrate
Meas. Tech.
ChEMBL_933537 (CHEMBL2319699)
IC50
18570±n/a nM
Citation
 Powell, NAHoffman, JKCiske, FLKohrt, JTBaxi, SMPeng, YWZhong, MCatana, COhren, JPerrin, LAEdmunds, JJ Optimization of highly selective 2,4-diaminopyrimidine-5-carboxamide inhibitors of Sky kinase. Bioorg Med Chem Lett 23:1051-5 (2013)  
Target
Name:
MAP kinase-activated protein kinase 2
Synonyms:
MAP kinase-activated protein kinase 2 (MAPKAPK2) MAP kinase-activated protein kinase 2 (p38/MK2) MAPK-activated protein kinase 2 MAPKAP kinase 2 MAPKAPK2 | MK2
Type:
Serine/threonine-protein kinase
Mol. Mass.:
45579.87
Organism:
Homo sapiens (Human)
Description:
P49137
Residue:
400
  
Inhibitor
Name:
BDBM50425862
Synonyms:
CHEMBL2312654
Type:
Small organic molecule
Emp. Form.:
C22H26Cl2N6O
Mol. Mass.:
461.387
SMILES:
CN(C)C1CCC(CC1)Nc1nc(Nc2cc(Cl)cc(Cl)c2)ncc1-c1cc(C)no1
: