Target
P-selectin
Ligand
BDBM50425876
Substrate
Meas. Tech.
ChEMBL_933984 (CHEMBL2318062)
IC50
6600±n/a nM
Citation
 Powell, NAHoffman, JKCiske, FLKohrt, JTBaxi, SMPeng, YWZhong, MCatana, COhren, JPerrin, LAEdmunds, JJ Optimization of highly selective 2,4-diaminopyrimidine-5-carboxamide inhibitors of Sky kinase. Bioorg Med Chem Lett 23:1051-5 (2013)  
Target
Name:
P-selectin
Synonyms:
GMRP LYAM3_HUMAN P-selectin/P-selectin glycoprotein ligand 1 | SELP
Type:
PROTEIN
Mol. Mass.:
90834.61
Organism:
Homo sapiens (Human)
Description:
ChEMBL_1438999
Residue:
830
  
Inhibitor
Name:
BDBM50425876
Synonyms:
CHEMBL2312343
Type:
Small organic molecule
Emp. Form.:
C22H30N6O3
Mol. Mass.:
426.512
SMILES:
COc1ccccc1CNc1ncc(C(=O)NCCNC(C)=O)c(NC2CCCC2)n1
: