Target
Histone deacetylase 1
Ligand
BDBM50425909
Substrate
Meas. Tech.
ChEMBL_934018 (CHEMBL2318096)
IC50
0.930000±n/a nM
Citation
 Narita, KFukui, YSano, YYamori, TIto, AYoshida, MKatoh, T Total synthesis of bicyclic depsipeptides spiruchostatins C and D and investigation of their histone deacetylase inhibitory and antiproliferative activities. Eur J Med Chem 60:295-304 (2013)  
Target
Name:
Histone deacetylase 1
Synonyms:
Cereblon/Histone deacetylase 1 HDAC1 Histone deacetylase 1 (HDAC1) RPD3L1
Type:
Enzyme
Mol. Mass.:
55090.27
Organism:
Homo sapiens (Human)
Description:
Q13547
Residue:
482
  
Inhibitor
Name:
BDBM50425909
Synonyms:
SPIRUCHOSTATIN C
Type:
Small organic molecule
Emp. Form.:
C23H37N3O7S3
Mol. Mass.:
563.751
SMILES:
CC[C@H](C)[C@H]1NC(=O)[C@H]2CSSCC\C=C\[C@H](CC(=O)N[C@H](CCS(C)=O)C(=O)N2)OC(=O)C[C@@H]1O
: