Target
Albumin
Ligand
BDBM50425945
Substrate
Meas. Tech.
ChEMBL_934194 (CHEMBL2319454)
IC50
21100±n/a nM
Citation
 Shantharam, CSSuyoga Vardhan, DMSuhas, RSridhara, MBGowda, DC Inhibition of protein glycation by urea and thiourea derivatives of glycine/proline conjugated benzisoxazole analogue - synthesis and structure-activity studies. Eur J Med Chem 60:325-32 (2013)  
Target
Name:
Albumin
Synonyms:
ALB Serum albumin | serum albumin precursor
Type:
PROTEIN
Mol. Mass.:
69288.15
Organism:
Bos taurus
Description:
ChEMBL_1502598
Residue:
607
  
Inhibitor
Name:
BDBM50425945
Synonyms:
CHEMBL2313737
Type:
Small organic molecule
Emp. Form.:
C22H23FN4O4
Mol. Mass.:
426.4408
SMILES:
COc1cccc(NC(=O)NCC(=O)N2CCC(CC2)c2noc3cc(F)ccc23)c1
: