Target
Induced myeloid leukemia cell differentiation protein Mcl-1
Ligand
BDBM50336576
Substrate
Meas. Tech.
ChEMBL_934367 (CHEMBL2320595)
Ki
58±n/a nM
Citation
 Zhang, ZLiu, CLi, XSong, TWu, ZLiang, XZhao, YShen, XChen, H Fragment-based design, synthesis, and biological evaluation of N-substituted-5-(4-isopropylthiophenol)-2-hydroxynicotinamide derivatives as novel Mcl-1 inhibitors. Eur J Med Chem 60:410-20 (2013)  
Target
Name:
Induced myeloid leukemia cell differentiation protein Mcl-1
Synonyms:
BCL2L3 Bcl-2-like protein 3 (Mcl-1) Bcl2-L-3 MCL1 Mcl-1 Myeloid cell leukemia sequence 1 (BCL2-related) | mcl1/EAT
Type:
Membrane; Single-pass membrane protein
Mol. Mass.:
37332.87
Organism:
Homo sapiens (Human)
Description:
Q07820
Residue:
350
  
Inhibitor
Name:
BDBM50336576
Synonyms:
3-Thiomorpholin-8-oxo-8H-acenaphtho[1,2-b]pyrrole-9-carbonitrile CHEMBL595134
Type:
Small organic molecule
Emp. Form.:
C19H13N3OS
Mol. Mass.:
331.391
SMILES:
O=c1nc2c3cccc4c(ccc(c2c1C#N)c34)N1CCSCC1
: