Target
Glutamate receptor ionotropic, NMDA 1/2A
Ligand
BDBM50425996
Substrate
Meas. Tech.
ChEMBL_934590 (CHEMBL2317551)
IC50
5.0±n/a nM
Citation
 Poulsen, MHLucas, SBach, TBBarslund, AFWenzler, CJensen, CBKristensen, ASStrømgaard, K Structure-activity relationship studies of argiotoxins: selective and potent inhibitors of ionotropic glutamate receptors. J Med Chem 56:1171-81 (2013)  
Target
Name:
Glutamate receptor ionotropic, NMDA 1/2A
Synonyms:
Glutamate NMDA receptor; Grin1/Grin2a | Glutamate [NMDA] receptor subunit epsilon 1/zeta 1
Type:
Mol. Mass.:
Description:
ASSAY_ID of EBI is 141020
Components:
This complex has 2 components.
Component 1
Name:
Glutamate receptor ionotropic, NMDA 2A
Synonyms:
Glutamate NMDA receptor; Grin1/Grin2a Grin2a NMDE1_RAT
Type:
Protein
Mol. Mass.:
165478.25
Organism:
Rattus norvegicus (Rat)
Description:
Q00959
Residue:
1464
  
Component 2
Name:
Glutamate receptor ionotropic, NMDA 1
Synonyms:
Glutamate (NMDA) receptor subunit zeta 1 Glutamate-NMDA-Channel Glutamate-NMDA-Polyamine NMDA Nmdar1 | phencyclidine
Type:
Enzyme Catalytic Domain
Mol. Mass.:
105533.40
Organism:
RAT
Description:
P35439
Residue:
938
  
Inhibitor
Name:
BDBM50425996
Synonyms:
CHEMBL2314718
Type:
Small organic molecule
Emp. Form.:
C35H53N9O5
Mol. Mass.:
679.8526
SMILES:
N[C@H](CCN=C(N)N)C(=O)NCCCCCNCCCCCCCNC(=O)[C@@H](NC(=O)Cc1ccc(O)cc1O)c1c[nH]c2ccccc12
: