Target
Thioredoxin
Ligand
BDBM50426066
Substrate
Meas. Tech.
ChEMBL_934906 (CHEMBL2319792)
IC50
90±n/a nM
Citation
 DiRaimondo, TRPlugis, NMJin, XKhosla, C Selective inhibition of extracellular thioredoxin by asymmetric disulfides. J Med Chem 56:1301-10 (2013)  
Target
Name:
Thioredoxin
Synonyms:
ADF SASP THIO_HUMAN TRX TXN
Type:
PROTEIN
Mol. Mass.:
11732.84
Organism:
Homo sapiens (Human)
Description:
ChEMBL_934906
Residue:
105
  
Inhibitor
Name:
BDBM50426066
Synonyms:
CHEMBL2315295
Type:
Small organic molecule
Emp. Form.:
C13H15N3O2S2
Mol. Mass.:
309.407
SMILES:
[O-][N+](=O)c1ccc2nc(SSC3CCCCC3)[nH]c2c1
: