Target
Integrin alpha-L
Ligand
BDBM34168
Substrate
Meas. Tech.
ChEMBL_935193 (CHEMBL2317562)
Kd
12900±n/a nM
Citation
 San Sebastián, EZimmerman, TZubia, AVara, YMartin, ESirockin, FDejaegere, AStote, RHLopez, XPantoja-Uceda, DValcárcel, MMendoza, LVidal-Vanaclocha, FCossío, FPBlanco, FJ Design, synthesis, and functional evaluation of leukocyte function associated antigen-1 antagonists in early and late stages of cancer development. J Med Chem 56:735-47 (2013)  
Target
Name:
Integrin alpha-L
Synonyms:
CD11 antigen-like family member A CD_antigen=CD11a ITGAL LFA-1A Leukocyte adhesion glycoprotein LFA-1 alpha chain | Leukocyte function-associated molecule 1 alpha chain
Type:
PROTEIN
Mol. Mass.:
128748.90
Organism:
Homo sapiens (Human)
Description:
ChEMBL_629045
Residue:
1170
  
Inhibitor
Name:
BDBM34168
Synonyms:
LOVASTATIN SMR000058779 US9353061, Lovastatina | cid_53232
Type:
Small organic molecule
Emp. Form.:
C24H36O5
Mol. Mass.:
404.5396
SMILES:
CC[C@H](C)C(=O)O[C@H]1C[C@@H](C)C=C2C=C[C@H](C)[C@H](CC[C@@H]3C[C@@H](O)CC(=O)O3)[C@@H]12
: